{"text_format":"1","workbook":"xlsx","n_sheets":9,"sheets":["Intro","DB Screen1","DB Screen2","Calc","Notes","Diet","Running","Workout","Track Pics"],"not_rendered":{"charts":3,"images":41,"macros":1,"external_links":0,"defined_names":23,"comments":0,"pivot_tables":3},"unopened":[],"bounds":{"document_bytes":16777216,"sheet_cells":100000,"rows_first":2000,"rows_last":500,"rows_between":2000,"halvings":0,"cell_chars":16384,"cell_head_chars":4096},"cells_cut":0,"cells_raw":0,"read":"whole","date_system":"1900"}

{"sheet":"Intro","index":0,"n_rows":20,"n_cols":7,"rows_kept":20,"cut":false,"hidden":false,"merged":[]}
[]
[]
[]
[]
[]
[]
[]
[]
[]
[]
[]
[]
[]
[]
[]
[]
[]
[]
[]
[null,null,null,null,null,null,"Read the full story here"]

{"sheet":"DB Screen1","index":1,"n_rows":25,"n_cols":10,"rows_kept":25,"cut":false,"hidden":false,"merged":[[23,1,23,2]]}
[null,"30 DAY CHALLENGE - DASHBOARD"]
[]
[]
[]
[]
[]
[]
[]
[]
[]
[null,{"$f":"\"On \"&TEXT(MIN(xaxis.date),\"dd mmm\")","v":"On 06 Mar"},"Stats",null,"Weight (Kg)",{"$f":"IFERROR(CHOOSE(activity,MATCH(Dropdwn1,Calc!$K$19:$O$19,0),MATCH(Dropdwn1,Calc!$D$19:$H$19,0)),\"<--Reselect Variable\")","v":1},null,null,"Speed km/hr",{"$f":"IFERROR(CHOOSE(activity,MATCH(Dropdwn2,Calc!$K$19:$O$19,0),MATCH(Dropdwn2,Calc!$D$19:$H$19,0)),\"<--Reselect Variable\")","v":3}]
[null,{"$f":"Calc!I9","v":"Start"},{"$f":"Calc!J9","v":"06:48 PM"}]
[]
[null,{"$f":"Calc!I10","v":"Weight (Kg)"},{"$f":"Calc!J10","v":75.8}]
[]
[null,{"$f":"Calc!I11","v":"Duration (mm:ss)"},{"$f":"Calc!J11","v":"38:34"}]
[]
[null,{"$f":"Calc!I12","v":"Speed km/hr"},{"$f":"Calc!J12","v":"7.79"}]
[]
[null,{"$f":"Calc!I13","v":"Calories kcal"},{"$f":"Calc!J13","v":422}]
[]
[null,{"$f":"Calc!I14","v":"Distance km"},{"$f":"Calc!J14","v":5.01}]
[]
[null,"TRACK PICS"]
[null,{"$f":"MIN(xaxis.date)","v":"2016-03-06"},null,{"$f":"B25+1","v":"2016-03-07"},null,{"$f":"D25+1","v":"2016-03-08"},null,null,{"$f":"F25+1","v":"2016-03-09"}]

{"sheet":"DB Screen2","index":2,"n_rows":10,"n_cols":2,"rows_kept":10,"cut":false,"hidden":false,"merged":[]}
[null,"30 DAY CHALLENGE - DASHBOARD"]
[]
[]
[]
[]
[]
[]
[]
[]
[null,{"$f":"\"On \"&TEXT(Date.screen2,\"D mmm\")","v":"On 21 Mar"}]

{"sheet":"Calc","index":3,"n_rows":49,"n_cols":35,"rows_kept":49,"cut":false,"hidden":true,"merged":[]}
[]
[null,"Selected Activity",2,null,null,{"$f":"INDEX(pics,DAY(MIN(xaxis.date)))","v":0}]
[null,{"$f":"CHOOSE(activity,B10,E10)","v":"Running Time (hrs)"},{"$f":"CHOOSE(activity,C10,TEXT(F10,\"hh:mm\"))","v":"18:45"},null,null,{"$f":"INDEX(pics,DAY(MIN(xaxis.date))+1)","v":0}]
[null,{"$f":"CHOOSE(activity,B11,E11)","v":"Kms"},{"$f":"CHOOSE(activity,C11,F11)","v":161.55999999999997},null,null,{"$f":"INDEX(pics,DAY(MIN(xaxis.date))+2)","v":0}]
[null,{"$f":"CHOOSE(activity,B12,E12)","v":"Avg Speed"},{"$f":"CHOOSE(activity,C12,TEXT(F12,\"0.00\"))","v":"8.61"}]
[null,{"$f":"CHOOSE(activity,B13,E13)","v":"Calories"},{"$f":"CHOOSE(activity,C13,F13)","v":13598}]
[]
[null,"Overall Stats",null,null,null,null,null,null,"Time Line Selection for single day",null,null,null,null,"Selection in Drop Downs",null,null,"Cumulative Drop Down Running","Cumulative Drop Down Workout"]
[null,"for Workout",null,null,"for running",null,null,null,{"$f":"CHOOSE(activity,L19,C19)","v":"Start"},{"$f":"CHOOSE(activity,L20,TEXT(C20,\"hh:mm am/pm\"))","v":"06:48 PM"},null,null,null,null,null,null,{"$f":"E19","v":"Duration (mm:ss)"},{"$f":"L19","v":"Pull Ups"}]
[null,"Pull Ups",{"$f":"SUM(Workout!B2:B31)","v":528},null,"Running Time (hrs)",{"$f":"SUM(Running[Duration])","v":0.78152777777777782},null,null,{"$f":"CHOOSE(activity,M19,D19)","v":"Weight (Kg)"},{"$f":"CHOOSE(activity,M20,D20)","v":75.8},null,null,null,{"$f":"CHOOSE(activity,OFFSET($K$20,,,COUNTA($K$20:$K$51)),OFFSET($B$20,,,COUNTA($B$20:$B$51)))","v":{"$error":"#VALUE!"}},null,null,{"$f":"H19","v":"Distance km"},{"$f":"M19","v":"Push Ups"}]
[null,"Push Ups",{"$f":"SUM(Workout!C2:C31)","v":1035},null,"Kms",{"$f":"SUM(Running[Distance])","v":161.55999999999997},null,null,{"$f":"CHOOSE(activity,N19,E19)","v":"Duration (mm:ss)"},{"$f":"CHOOSE(activity,N20,TEXT(E20,\"mm:ss\"))","v":"38:34"},null,null,null,{"$f":"Prim.Axis","v":{"$error":"#VALUE!"}},null,null,{"$f":"G19","v":"Calories kcal"},{"$f":"N19","v":"Squats"}]
[null,"Squats",{"$f":"SUM(Workout!D2:D31)","v":400},null,"Avg Speed",{"$f":"F11/(F10/Running!L1)","v":8.6134707659498826},null,null,{"$f":"CHOOSE(activity,O19,F19)","v":"Speed km/hr"},{"$f":"CHOOSE(activity,O20,TEXT(F20,\"0.00\"))","v":"7.79"},null,null,null,null,null,null,null,{"$f":"O19","v":"Bench Dips"}]
[null,"Bench Dips",{"$f":"SUM(Workout!E2:E31)","v":140},null,"Calories",{"$f":"SUM(IFERROR(VALUE(LEFT(Running!H2:H31,3)),0))","v":13598},null,null,{"$f":"CHOOSE(activity,P19,G19)","v":"Calories kcal"},{"$f":"CHOOSE(activity,P20,G20)","v":422}]
[null,null,null,null,null,null,null,null,{"$f":"CHOOSE(activity,Q19,H19)","v":"Distance km"},{"$f":"CHOOSE(activity,Q20,H20)","v":5.01}]
[null,null,null,null,null,null,null,null,null,null,null,null,null,null,null,null,null,null,null,null,null,null,null,null,null,null,null,null,null,null,null,null,null,null,0]
[]
[null,null,null,null,null,null,null,null,null,null,null,null,null,null,null,null,null,null,null,null,null,null,null,null,null,null,null,"Items in total meals consumed"]
[null,null,null,null,null,null,null,null,null,null,null,null,null,null,null,null,null,null,null,null,"Primary Cumulative","Secondary Cumulative",null,"Date","Meal","Meal Type",null,"Chicken","Eggs","Milk","Wine/Beer","Nothing",null,"Wake Up time","Wake Up time"]
[null,"Date","Start","Weight (Kg)","Duration (mm:ss)","Speed km/hr","Calories kcal","Distance km",null,null,"Date","Pull Ups","Push Ups","Squats","Bench Dips","-","-",null,null,null,null,null,null,"2016-03-21","Sprouts, Chicken, 3 Eggs, Milk","Breakfast",null,{"$f":"SUM(IF(IFERROR(SEARCH(\"Chicken\",Diet[Meal]),0)>=1,1,0))","v":51},{"$f":"SUM(IF(IFERROR(SEARCH(\"Egg\",Diet[Meal]),0)>=1,1,0))+SUM(IF(IFERROR(SEARCH(\"Omel\",Diet[Meal]),0)>=1,1,0))","v":27},{"$f":"SUM(IF(IFERROR(SEARCH(\"Milk\",Diet[Meal]),0)>=1,1,0))","v":23},{"$f":"SUM(IF(IFERROR(SEARCH(\"Beer\",Diet[Meal]),0)>=1,1,0))+SUM(IF(IFERROR(SEARCH(\"Wine\",Diet[Meal]),0)>=1,1,0))","v":15},{"$f":"SUM(IF(IFERROR(SEARCH(\"Nothing\",Diet[Meal]),0)>=1,1,0))","v":13},null,{"$f":"VLOOKUP(Date.screen2,Running[],2,0)","v":"06:30:00"},{"$f":"IF(VLOOKUP(Date.screen2,Running[],10,0)<0.5,VLOOKUP(Date.screen2,Running[],10,0)+1,VLOOKUP(Date.screen2,Running[],10,0))","v":0.9375}]
[null,"2016-03-06","18:48:00",75.8,"00:38:34",7.7942955920484005,422,5.01,null,null,"2016-03-08",24,50,20,0,"-","-",null,null,null,{"$f":"IFERROR(OFFSET(Calc!$C$19,CHOOSE(activity,ROWS($B$20:$B20),ROWS($K$20:$K20)),MATCH(Dropdwn3,Calc!$D$19:$O$19,0),),NA())+U19","v":{"$error":"#N/A"}},{"$f":"IFERROR((xaxis.date<=CHOOSE(activity,$K20,$B20))*OFFSET(Calc!$C$19,CHOOSE(activity,ROWS($B$20:$B20),ROWS($K$20:$K20)),MATCH(Dropdwn4,Calc!$D$19:$O$19,0),),NA())+V19","v":{"$error":"#N/A"}},null,"2016-03-21","Mixed Veg, 3 Chapattis, Curd","Lunch"]
[null,"2016-03-07","19:48:00",76.099999999999994,"00:37:28",8.0071174377224175,425,5,null,null,"2016-03-09",22,25,0,0,null,null,null,null,null,{"$f":"IFERROR((xaxis.date<=CHOOSE(activity,$K21,$B21))*OFFSET(Calc!$C$19,CHOOSE(activity,ROWS($B$20:$B21),ROWS($K$20:$K21)),MATCH(Dropdwn3,Calc!$D$19:$O$19,0),),NA())+U20","v":{"$error":"#N/A"}},{"$f":"IFERROR((xaxis.date<=CHOOSE(activity,$K21,$B21))*OFFSET(Calc!$C$19,CHOOSE(activity,ROWS($B$20:$B21),ROWS($K$20:$K21)),MATCH(Dropdwn4,Calc!$D$19:$O$19,0),),NA())+V20","v":{"$error":"#N/A"}},null,"2016-03-21","Chicken Omelette","Evening Snack"]
[null,"2016-03-08","18:37:00",75.7,"00:36:25",8.2544622425629282,467,5.01,null,null,"2016-03-10",24,25,10,0,null,null,null,null,null,{"$f":"IFERROR((xaxis.date<=CHOOSE(activity,$K22,$B22))*OFFSET(Calc!$C$19,CHOOSE(activity,ROWS($B$20:$B22),ROWS($K$20:$K22)),MATCH(Dropdwn3,Calc!$D$19:$O$19,0),),NA())+U21","v":{"$error":"#N/A"}},{"$f":"IFERROR((xaxis.date<=CHOOSE(activity,$K22,$B22))*OFFSET(Calc!$C$19,CHOOSE(activity,ROWS($B$20:$B22),ROWS($K$20:$K22)),MATCH(Dropdwn4,Calc!$D$19:$O$19,0),),NA())+V21","v":{"$error":"#N/A"}},null,"2016-03-21","Pulses, Lady finger, 3 Chapattis","Dinner",null,"Diet Order"]
[null,"2016-03-09","18:59:00",75.7,"00:36:06",8.3434903047091389,467,5.0199999999999996,null,null,"2016-03-11",34,80,0,40,null,null,null,null,null,{"$f":"IFERROR((xaxis.date<=CHOOSE(activity,$K23,$B23))*OFFSET(Calc!$C$19,CHOOSE(activity,ROWS($B$20:$B23),ROWS($K$20:$K23)),MATCH(Dropdwn3,Calc!$D$19:$O$19,0),),NA())+U22","v":{"$error":"#N/A"}},{"$f":"IFERROR((xaxis.date<=CHOOSE(activity,$K23,$B23))*OFFSET(Calc!$C$19,CHOOSE(activity,ROWS($B$20:$B23),ROWS($K$20:$K23)),MATCH(Dropdwn4,Calc!$D$19:$O$19,0),),NA())+V22","v":{"$error":"#N/A"}},null,null,null,null,null,"Breakfast",{"$f":"INDEX($Y$19:$Y$22,MATCH(AB23,$Z$19:$Z$22,0))","v":"Sprouts, Chicken, 3 Eggs, Milk"}]
[null,"2016-03-10","19:13:00",75.599999999999994,"00:34:38",8.7661212704523575,428,5.0599999999999996,null,null,"2016-03-12",20,50,0,0,null,null,null,null,null,{"$f":"IFERROR((xaxis.date<=CHOOSE(activity,$K24,$B24))*OFFSET(Calc!$C$19,CHOOSE(activity,ROWS($B$20:$B24),ROWS($K$20:$K24)),MATCH(Dropdwn3,Calc!$D$19:$O$19,0),),NA())+U23","v":{"$error":"#N/A"}},{"$f":"IFERROR((xaxis.date<=CHOOSE(activity,$K24,$B24))*OFFSET(Calc!$C$19,CHOOSE(activity,ROWS($B$20:$B24),ROWS($K$20:$K24)),MATCH(Dropdwn4,Calc!$D$19:$O$19,0),),NA())+V23","v":{"$error":"#N/A"}},null,null,null,null,null,"Lunch",{"$f":"INDEX($Y$19:$Y$22,MATCH(AB24,$Z$19:$Z$22,0))","v":"Mixed Veg, 3 Chapattis, Curd"}]
[null,"2016-03-11","07:07:00",75.900000000000006,"00:35:32",8.4765478424014997,426,5.0199999999999996,null,null,"2016-03-13",24,25,30,0,null,null,null,null,null,{"$f":"IFERROR((xaxis.date<=CHOOSE(activity,$K25,$B25))*OFFSET(Calc!$C$19,CHOOSE(activity,ROWS($B$20:$B25),ROWS($K$20:$K25)),MATCH(Dropdwn3,Calc!$D$19:$O$19,0),),NA())+U24","v":{"$error":"#N/A"}},{"$f":"IFERROR((xaxis.date<=CHOOSE(activity,$K25,$B25))*OFFSET(Calc!$C$19,CHOOSE(activity,ROWS($B$20:$B25),ROWS($K$20:$K25)),MATCH(Dropdwn4,Calc!$D$19:$O$19,0),),NA())+V24","v":{"$error":"#N/A"}},null,null,null,null,null,"Evening Snack","Chicken Omelette"]
[null,"2016-03-12","18:47:00",76,"00:38:01",7.9070583077597538,452,5.01,null,null,"2016-03-14",15,30,0,0,null,null,null,null,null,{"$f":"IFERROR((xaxis.date<=CHOOSE(activity,$K26,$B26))*OFFSET(Calc!$C$19,CHOOSE(activity,ROWS($B$20:$B26),ROWS($K$20:$K26)),MATCH(Dropdwn3,Calc!$D$19:$O$19,0),),NA())+U25","v":{"$error":"#N/A"}},{"$f":"IFERROR((xaxis.date<=CHOOSE(activity,$K26,$B26))*OFFSET(Calc!$C$19,CHOOSE(activity,ROWS($B$20:$B26),ROWS($K$20:$K26)),MATCH(Dropdwn4,Calc!$D$19:$O$19,0),),NA())+V25","v":{"$error":"#N/A"}},null,null,null,null,null,"Dinner","Pulses, Lady finger, 3 Chapattis"]
[null,"2016-03-13","19:02:00",75.900000000000006,"00:35:00",8.6228571428571428,426,5.03,null,null,"2016-03-15",24,50,0,0,null,null,null,null,null,{"$f":"IFERROR((xaxis.date<=CHOOSE(activity,$K27,$B27))*OFFSET(Calc!$C$19,CHOOSE(activity,ROWS($B$20:$B27),ROWS($K$20:$K27)),MATCH(Dropdwn3,Calc!$D$19:$O$19,0),),NA())+U26","v":{"$error":"#N/A"}},{"$f":"IFERROR((xaxis.date<=CHOOSE(activity,$K27,$B27))*OFFSET(Calc!$C$19,CHOOSE(activity,ROWS($B$20:$B27),ROWS($K$20:$K27)),MATCH(Dropdwn4,Calc!$D$19:$O$19,0),),NA())+V26","v":{"$error":"#N/A"}}]
[null,"2016-03-14","19:40:00",76.599999999999994,"00:34:30",8.8695652173913047,431,5.0999999999999996,null,null,"2016-03-16",24,50,40,0,null,null,null,null,null,{"$f":"IFERROR((xaxis.date<=CHOOSE(activity,$K28,$B28))*OFFSET(Calc!$C$19,CHOOSE(activity,ROWS($B$20:$B28),ROWS($K$20:$K28)),MATCH(Dropdwn3,Calc!$D$19:$O$19,0),),NA())+U27","v":{"$error":"#N/A"}},{"$f":"IFERROR((xaxis.date<=CHOOSE(activity,$K28,$B28))*OFFSET(Calc!$C$19,CHOOSE(activity,ROWS($B$20:$B28),ROWS($K$20:$K28)),MATCH(Dropdwn4,Calc!$D$19:$O$19,0),),NA())+V27","v":{"$error":"#N/A"}}]
[null,"2016-03-15","19:01:00",75.7,"00:39:25",7.626215644820296,418,5.01,null,null,"2016-03-17",20,50,40,0,null,null,null,null,null,{"$f":"IFERROR((xaxis.date<=CHOOSE(activity,$K29,$B29))*OFFSET(Calc!$C$19,CHOOSE(activity,ROWS($B$20:$B29),ROWS($K$20:$K29)),MATCH(Dropdwn3,Calc!$D$19:$O$19,0),),NA())+U28","v":{"$error":"#N/A"}},{"$f":"IFERROR((xaxis.date<=CHOOSE(activity,$K29,$B29))*OFFSET(Calc!$C$19,CHOOSE(activity,ROWS($B$20:$B29),ROWS($K$20:$K29)),MATCH(Dropdwn4,Calc!$D$19:$O$19,0),),NA())+V28","v":{"$error":"#N/A"}}]
[null,"2016-03-16","19:39:00",76.099999999999994,"00:36:31",8.2318575992697394,426,5.01,null,null,"2016-03-18",20,50,0,0,null,null,null,null,null,{"$f":"IFERROR((xaxis.date<=CHOOSE(activity,$K30,$B30))*OFFSET(Calc!$C$19,CHOOSE(activity,ROWS($B$20:$B30),ROWS($K$20:$K30)),MATCH(Dropdwn3,Calc!$D$19:$O$19,0),),NA())+U29","v":{"$error":"#N/A"}},{"$f":"IFERROR((xaxis.date<=CHOOSE(activity,$K30,$B30))*OFFSET(Calc!$C$19,CHOOSE(activity,ROWS($B$20:$B30),ROWS($K$20:$K30)),MATCH(Dropdwn4,Calc!$D$19:$O$19,0),),NA())+V29","v":{"$error":"#N/A"}}]
{"$rows_left_out":20}
{"sheet":"Notes","index":4,"n_rows":33,"n_cols":4,"rows_kept":33,"cut":false,"hidden":true,"merged":[]}
[]
[null,"Number Crunching and Analysis"]
[]
[null,"Workouts"]
[null,null,"no of workout type on any day"]
[null,null,"total number of repitions till that day"]
[]
[null,null,"Running start time"]
[]
[null,null,"trend in weight"]
[null,null,"trend in speed"]
[]
[null,null,"single day calorie burnt"]
[null,null,"total calorie burnt"]
[]
[null,null,"single day duration of running"]
[null,null,"total duration of running"]
[]
[null,null,"single day kms"]
[null,null,"total kms"]
[]
[null,"Routine"]
[null,null,"get up time"]
[null,null,"hours worked"]
[null,null,"sleep time"]
[]
[null,null,"meal during each meal type daily"]
[null,null,"total consumption days of an items during the month"]
[null,null,null,"Meat"]
[null,null,null,"Alcohol"]
{"$rows_left_out":4}
{"sheet":"Diet","index":5,"n_rows":121,"n_cols":4,"rows_kept":121,"cut":false,"hidden":true,"merged":[]}
["Date","Meal","Meal Type","Notes"]
["2016-03-01","Sprouts, Chicken, 3 Eggs, Milk, Almonds","Breakfast"]
["2016-03-01","Ridge Gourd, 3 Chapattis, Curd","Lunch"]
["2016-03-01","1 Apple","Evening Snack"]
["2016-03-01","Pulses, Potato & Capsicum, 3 Chapattis","Dinner"]
["2016-03-02","Sprouts, Chicken, 3 Eggs, Milk, Almonds","Breakfast"]
["2016-03-02","2 Slices of Multigrain Bread, Cooked Gravy Chicken, 3 Chapattis, 2 Beers (660 ml)","Lunch","Went out on a date with my gf ;)"]
["2016-03-02","Nothing","Evening Snack"]
["2016-03-02","Nothing","Dinner"]
["2016-03-03","Sprouts, Chicken, 3 Eggs, Milk, Almonds","Breakfast"]
["2016-03-03","Pulses, Curd, 3 Chapattis","Lunch"]
["2016-03-03","Soy Milk, Chicken Ham","Evening Snack"]
["2016-03-03","Pulses, Papaya, 3 Chapattis","Dinner"]
["2016-03-04","Sprouts, Chicken, 3 Eggs, Milk, Almonds","Breakfast"]
["2016-03-04","Green Chickpeas, 3 Chapattis, Curd","Lunch"]
["2016-03-04","2 Slices of Multigrain Bread, Chicken Ham","Evening Snack"]
["2016-03-04","Pulses, 3 Chapattis","Dinner"]
["2016-03-05","Chicken Omelette, 2 Slices of Multigrain Bread, Milk","Breakfast"]
["2016-03-05","Rice, legumes, Curd","Lunch"]
["2016-03-05","Papaya","Evening Snack"]
["2016-03-05","Pulses, 3 Chapattis","Dinner"]
["2016-03-06","Sprouts, Chicken, 3 Eggs, Milk, Almonds","Breakfast"]
["2016-03-06","legumes, 3 Chapattis, Chicken Omelette","Lunch"]
["2016-03-06","Nothing","Evening Snack"]
["2016-03-06","Beer, Gravy Chicken, 6 Chapatti, Coke, Ice Cream","Dinner","Treat dinner for India Bangladesh, Asia Cup Finals"]
["2016-03-07","Sprouts, Chicken, 3 Eggs, Milk, Almonds","Breakfast"]
["2016-03-07","Guard, 3 Chapattis","Lunch"]
["2016-03-07","2 Slices of Multigrain Bread","Evening Snack"]
["2016-03-07","Pumpkin, Pulses, 4 Chapattis","Dinner"]
["2016-03-08","Sprouts, Chicken, 3 Eggs, Milk, Almonds","Breakfast"]
{"$rows_left_out":92}
{"sheet":"Running","index":6,"n_rows":31,"n_cols":14,"rows_kept":31,"cut":false,"hidden":true,"merged":[]}
["Date","Wake up time","Start Time","End Time","Speed","Distance","Duration","Calories Burnt","Weight","Sleep time","Column1","01:00:00"]
["2016-03-01","06:25:00","06:43:00",{"$f":"C2+G2","v":"07:19:18"},{"$f":"F2/(G2/$L$1)","v":8.2809917355371905},5.01,"00:36:18",412,77.099999999999994,"23:05:00",0.96180555555555547]
["2016-03-02","07:25:00","07:39:00","08:12:44",8.9288537549407074,5.0199999999999996,"00:33:44",424,77.099999999999994,"22:00:00",0.91666666666666663]
["2016-03-03","06:15:00","18:34:00","19:11:47",8.1782090868989847,5.15,"00:37:47",438,76.2,"22:45:00",0.94791666666666663]
["2016-03-04","06:25:00","06:59:00","07:34:17",8.6896551724137936,5.1100000000000003,"00:35:17",433,76.099999999999994,"23:10:00",0.96527777777777779]
["2016-03-05","07:45:00","18:25:00","19:01:00",8.5833333333333339,5.15,"00:36:00",438,76.099999999999994,"22:10:00",0.92361111111111116]
["2016-03-06","07:30:00","18:48:00","19:26:34",7.7942955920484005,5.01,"00:38:34",422,75.8,"00:10:00",6.9444444444444441E-3]
["2016-03-07","08:30:00","19:48:00","20:25:28",8.0071174377224175,5,"00:37:28",425,76.099999999999994,"23:30:00",0.97916666666666663]
["2016-03-08","07:40:00","18:37:00","19:13:25",8.2544622425629282,5.01,"00:36:25",467,75.7,"23:10:00",0.96527777777777779]
["2016-03-09","07:15:00","18:59:00","19:35:06",8.3434903047091389,5.0199999999999996,"00:36:06",467,75.7,"23:30:00",0.97916666666666663]
["2016-03-10","06:45:00","19:13:00","19:47:38",8.7661212704523575,5.0599999999999996,"00:34:38",428,75.599999999999994,"22:50:00",0.95138888888888884]
["2016-03-11","06:25:00","07:07:00","07:42:32",8.4765478424014997,5.0199999999999996,"00:35:32",426,75.900000000000006,"23:05:00",0.96180555555555547]
["2016-03-12","07:30:00","18:47:00","19:25:01",7.9070583077597538,5.01,"00:38:01",452,76,"23:20:00",0.97222222222222221]
["2016-03-13","08:30:00","19:02:00","19:37:00",8.6228571428571428,5.03,"00:35:00",426,75.900000000000006,"22:00:00",0.91666666666666663]
["2016-03-14","06:25:00","19:40:00","20:14:30",8.8695652173913047,5.0999999999999996,"00:34:30",431,76.599999999999994,"22:35:00",0.94097222222222221]
["2016-03-15","06:15:00","19:01:00","19:40:25",7.626215644820296,5.01,"00:39:25",418,75.7,"22:30:00",0.9375]
["2016-03-16","06:20:00","19:39:00","20:15:31",8.2318575992697394,5.01,"00:36:31",426,76.099999999999994,"23:00:00",0.95833333333333337,null,null,"00:00:00"]
["2016-03-17","06:20:00","19:04:00","19:40:20",8.2899082568807323,5.0199999999999996,"00:36:20",426,75.3,"23:05:00",0.96180555555555547]
["2016-03-18","07:00:00","19:06:00","19:43:42",7.9893899204244017,5.0199999999999996,"00:37:42",426,75.5,"23:30:00",0.97916666666666663,null,null,8.3333329999999997E-2]
["2016-03-19","04:30:00","06:00:00","07:11:10",8.6838407494145198,10.3,"01:11:10",872,75.599999999999994,"23:30:00",0.97916666666666663,null,null,"02:24:00"]
["2016-03-20","05:00:00","06:03:00","07:10:40",9.2039408866995061,10.38,"01:07:40",874,75.5,"23:00:00",0.95833333333333337]
["2016-03-21","06:30:00","19:41:00","20:16:38",8.4359214218896135,5.01,"00:35:38",410,76.400000000000006,"22:30:00",0.9375]
["2016-03-22","07:00:00","07:50:00","08:21:05",9.7093833780160868,5.03,"00:31:05",406,75.7,"00:30:00",2.0833333333333332E-2]
["2016-03-23","04:30:00","18:08:00","18:41:24",8.9999999999999982,5.01,"00:33:24",407,75.599999999999994,"00:30:00",2.0833333333333332E-2,"12:00:00",0.99930555555555556]
["2016-03-24","09:00:00","18:32:00","19:04:48",9.2012195121951237,5.03,"00:32:48",408,75.599999999999994,"00:55:00",3.8194444444444441E-2,0]
["2016-03-25","09:30:00","17:58:00","18:29:31",9.5378106821787423,5.01,"00:31:31",405,75.400000000000006,"01:30:00",6.25E-2,6.25E-2,null,{"$f":"MIN(Running[Sleep time])","v":"00:00:00"}]
["2016-03-26","10:00:00","19:39:00","20:15:19",8.2606700321248265,5,"00:36:19",410,75.400000000000006,"00:30:00",2.0833333333333332E-2]
["2016-03-27","08:00:00","10:21:00","10:53:52",9.1460446247464482,5.01,"00:32:52",407,75.3,"23:45:00",0.98958333333333337]
["2016-03-28","10:00:00","20:14:00","20:48:27",8.743105950653117,5.0199999999999996,"00:34:27",409,75.2,"01:30:00",6.25E-2]
["2016-03-29","10:00:00","19:38:00","20:12:09",8.8023426061493399,5.01,"00:34:09",408,75.099999999999994,"01:30:00",6.25E-2]
{"$rows_left_out":2}
{"sheet":"Workout","index":7,"n_rows":31,"n_cols":5,"rows_kept":31,"cut":false,"hidden":true,"merged":[]}
["Date","Pull Ups","Push Ups","Squats","Bench Dips"]
["2016-03-01",25,50,15,0]
["2016-03-02",23,50,0,0]
["2016-03-03",30,60,50,40]
["2016-03-04",20,50,45,0]
["2016-03-05",24,50,40,30]
["2016-03-06",24,50,40,0]
["2016-03-07",24,50,20,0]
["2016-03-08",24,50,20,0]
["2016-03-09",22,25,0,0]
["2016-03-10",24,25,10,0]
["2016-03-11",34,80,0,40]
["2016-03-12",20,50,0,0]
["2016-03-13",24,25,30,0]
["2016-03-14",15,30,0,0]
["2016-03-15",24,50,0,0]
["2016-03-16",24,50,40,0]
["2016-03-17",20,50,40,0]
["2016-03-18",20,50,0,0]
["2016-03-19",12,40,25,15]
["2016-03-20",25,50,25,15]
["2016-03-21",25,50,0,0]
["2016-03-22",25,50,0,0]
["2016-03-23",0,0,0,0]
["2016-03-24",0,0,0,0]
["2016-03-25",0,0,0,0]
["2016-03-26",0,0,0,0]
["2016-03-27",0,0,0,0]
["2016-03-28",0,0,0,0]
["2016-03-29",0,0,0,0]
{"$rows_left_out":2}
{"sheet":"Track Pics","index":8,"n_rows":31,"n_cols":3,"rows_kept":31,"cut":false,"hidden":true,"merged":[]}
[]
[null,null,1]
[null,null,{"$f":"C2+1","v":2}]
[null,null,{"$f":"C3+1","v":3}]
[null,null,4]
[null,"It was raining so I \nRan Without a tracker :)",5]
[null,null,6]
[null,null,7]
[null,null,8]
[null,null,9]
[null,null,10]
[null,null,11]
[null,null,12]
[null,null,13]
[null,null,14]
[null,null,15]
[null,null,16]
[null,null,17]
[null,null,18]
[null,null,19]
[null,null,20]
[null,null,21]
[null,null,22]
[null,null,23]
[null,null,24]
[null,null,25]
[null,null,26]
[null,null,27]
[null,null,28]
[null,null,29]
{"$rows_left_out":1}